Target
Delta-type opioid receptor
Ligand
BDBM50096716
Substrate
Meas. Tech.
ChEBML_145890
IC50
0.170000±n/a nM
Citation
 Sasaki, YHirabuki, MAmbo, AOuchi, HYamamoto, Y Enkephalin analogues with 2',6'-dimethylphenylalanine replacing phenylalanine in position 4. Bioorg Med Chem Lett 11:327-9 (2001)  
Target
Name:
Delta-type opioid receptor
Synonyms:
DOR-1 MSL-2 OPRD_MOUSE Oprd1
Type:
Enzyme Catalytic Domain
Mol. Mass.:
40577.25
Organism:
MOUSE
Description:
P32300
Residue:
372
  
Inhibitor
Name:
BDBM50096716
Synonyms:
CHEMBL100480 | Enkephalin derivative
Type:
Small organic molecule
Emp. Form.:
C30H41N5O7
Mol. Mass.:
583.6758
SMILES:
CC(C)C[C@H](NC(=O)[C@H](Cc1ccccc1)NC(=O)CNC(=O)CNC(=O)[C@@H](N)Cc1c(C)cc(O)cc1C)C(O)=O
: