Target
Genome polyprotein/Non-structural protein 4A
Ligand
BDBM50096728
Substrate
Meas. Tech.
ChEMBL_144673 (CHEMBL750632)
IC50
7±n/a nM
Citation
 Bennett, JMCampbell, ADCampbell, AJCarr, MGDunsdon, RMGreening, JRHurst, DNJennings, NSJones, PSJordan, SKay, PBO'Brien, MAKing-Underwood, JRaynham, TMWilkinson, CSWilkinson, TCWilson, FX The identification of alpha-ketoamides as potent inhibitors of hepatitis C virus NS3-4A proteinase. Bioorg Med Chem Lett 11:355-7 (2001)  
Target
Name:
Genome polyprotein/Non-structural protein 4A
Synonyms:
Hepatitis C virus serine protease, NS3/NS4A
Type:
Mol. Mass.:
Description:
ASSAY_ID of ChEMBL is 1969955
Components:
This complex has 2 components.
Component 1
Name:
Non-structural protein 4A
Synonyms:
Hepatitis C virus NS4A protein Non-structural protein 4A
Type:
PROTEIN
Mol. Mass.:
5762.65
Organism:
Hepatitis C virus
Description:
ChEMBL_305334
Residue:
54
  
Component 2
Name:
Genome polyprotein
Synonyms:
Hepatitis C virus NS3 protease/helicase | Hepatitis C virus serine protease, NS3/NS4A
Type:
Protein
Mol. Mass.:
67067.41
Organism:
Hepatitis C virus
Description:
A3EZI9
Residue:
631
  
Inhibitor
Name:
BDBM50096728
Synonyms:
(S)-4-((S)-1-{(S)-1-[(S)-1-((S)-1-Amino-2-carbamoyl-2-oxo-ethylcarbamoyl)-3-methyl-butylcarbamoyl]-2,2-dimethyl-propylcarbamoyl}-2-o-tolyl-ethylcarbamoyl)-4-[(S)-3-carboxy-2-(3-carboxy-propionylamino)-propionylamino]-butyric acid | CHEMBL120084
Type:
Small organic molecule
Emp. Form.:
C38H56N8O14
Mol. Mass.:
848.8964
SMILES:
CC(C)C[C@H](NC(=O)[C@@H](NC(=O)[C@H](Cc1ccccc1C)NC(=O)[C@H](CCC(O)=O)NC(=O)[C@H](CC(O)=O)NC(=O)CCC(O)=O)C(C)(C)C)C(=O)N[C@H](N)C(=O)C(N)=O
: