Target
D(2) dopamine receptor
Ligand
BDBM29644
Substrate
Meas. Tech.
ChEMBL_61456 (CHEMBL670883)
Ki
42±n/a nM
Citation
 Linnanen, TBrisander, MMohell, NJohansson, AM Serotonergic and dopaminergic activities of rigidified (R)-aporphine derivatives. Bioorg Med Chem Lett 11:367-70 (2001)  
Target
Name:
D(2) dopamine receptor
Synonyms:
D(2) dopamine receptor DOPAMINE D2 Long DRD2 Dopamine D2 receptor Dopamine D2 receptor (D2R) Dopamine2-like | d2
Type:
Cell-surface receptors
Mol. Mass.:
50647.10
Organism:
Homo sapiens (Human)
Description:
P14416
Residue:
443
  
Inhibitor
Name:
BDBM29644
Synonyms:
(6aR)-6-methyl-5,6,6a,7-tetrahydro-4H-dibenzo[de,g]quinoline-10,11-diol;hydrate;hydrochloride APOMORPHINE HYDROCHLORIDE HEMIHYDRATE SMR000059235 | cid_6852399
Type:
Small organic molecule
Emp. Form.:
C17H17NO2
Mol. Mass.:
267.3224
SMILES:
CN1CCc2cccc-3c2[C@H]1Cc1ccc(O)c(O)c-31
: