Target
Somatostatin receptor type 2
Ligand
BDBM50096829
Substrate
Meas. Tech.
ChEBML_200365
Ki
2.8±n/a nM
Citation
 Zhou, CGuo, LMorriello, GPasternak, APan, YRohrer, SPBirzin, ETHuskey, SEJacks, TSchleim, KDCheng, KSchaeffer, JMPatchett, AAYang, L Nipecotic and iso-nipecotic amides as potent and selective somatostatin subtype-2 receptor agonists. Bioorg Med Chem Lett 11:415-7 (2001)  
Target
Name:
Somatostatin receptor type 2
Synonyms:
SOMATOSTATIN SST2 SS-2-R SS2R SSTR2 | Somatostatin receptor type 2 (SSTR2)
Type:
Enzyme
Mol. Mass.:
41344.94
Organism:
Homo sapiens (Human)
Description:
P30874
Residue:
369
  
Inhibitor
Name:
BDBM50096829
Synonyms:
(S)-6-Amino-2-[(S)-2-{[1-(2-hydroxy-2,2-diphenyl-acetyl)-piperidine-3-carbonyl]-amino}-3-(1H-indol-3-yl)-butyrylamino]-hexanoic acid tert-butyl ester | CHEMBL134163
Type:
Small organic molecule
Emp. Form.:
C42H53N5O6
Mol. Mass.:
723.9001
SMILES:
C[C@H](C(NC(=O)C1CCCN(C1)C(=O)C(O)(c1ccccc1)c1ccccc1)C(=O)N[C@@H](CCCCN)C(=O)OC(C)(C)C)c1c[nH]c2ccccc12
: