Target
Somatostatin receptor type 2
Ligand
BDBM50096830
Substrate
Meas. Tech.
ChEBML_200365
Ki
2.3±n/a nM
Citation
 Zhou, CGuo, LMorriello, GPasternak, APan, YRohrer, SPBirzin, ETHuskey, SEJacks, TSchleim, KDCheng, KSchaeffer, JMPatchett, AAYang, L Nipecotic and iso-nipecotic amides as potent and selective somatostatin subtype-2 receptor agonists. Bioorg Med Chem Lett 11:415-7 (2001)  
Target
Name:
Somatostatin receptor type 2
Synonyms:
SOMATOSTATIN SST2 SS-2-R SS2R SSTR2 | Somatostatin receptor type 2 (SSTR2)
Type:
Enzyme
Mol. Mass.:
41344.94
Organism:
Homo sapiens (Human)
Description:
P30874
Residue:
369
  
Inhibitor
Name:
BDBM50096830
Synonyms:
(S)-6-Amino-2-[(S)-2-({1-[2-(3,5-difluoro-phenyl)-acetyl]-piperidine-3-carbonyl}-amino)-3-(1H-indol-3-yl)-butyrylamino]-hexanoic acid tert-butyl ester | CHEMBL336986
Type:
Small organic molecule
Emp. Form.:
C36H47F2N5O5
Mol. Mass.:
667.7857
SMILES:
C[C@H](C(NC(=O)C1CCCN(C1)C(=O)Cc1cc(F)cc(F)c1)C(=O)N[C@@H](CCCCN)C(=O)OC(C)(C)C)c1c[nH]c2ccccc12
: