Target
Delta-type opioid receptor
Ligand
BDBM50001040
Substrate
Meas. Tech.
ChEBML_147167
Ki
1100±n/a nM
Citation
 Wentland, MPLou, RYe, YCohen, DJRichardson, GPBidlack, JM 8-Carboxamidocyclazocine analogues: redefining the structure-activity relationships of 2,6-methano-3-benzazocines. Bioorg Med Chem Lett 11:623-6 (2001)  
Target
Name:
Delta-type opioid receptor
Synonyms:
D-OR-1 Delta opioid receptor OPIATE Delta OPRD1 OPRK1 | opioid receptor, delta 1
Type:
G Protein-Coupled Receptor (GPCR)
Mol. Mass.:
40382.98
Organism:
Homo sapiens (Human)
Description:
Competition binding assays were carried out using membrane preparations from transfected HN9.10 cells that constitutively expressed the delta opioid receptor.
Residue:
372
  
Inhibitor
Name:
BDBM50001040
Synonyms:
6,11-Dimethyl-3-(3-methyl-butyl)-1,2,3,4,5,6-hexahydro-2,6-methano-benzo[d]azocin-8-ol | CHEMBL2021605
Type:
Small organic molecule
Emp. Form.:
C17H23NO
Mol. Mass.:
257.3706
SMILES:
[H][C@@]12Cc3ccc(O)cc3[C@@](C)(CN1CC1CC1)[C@@H]2C
: