Target
Coagulation factor X
Ligand
BDBM50097624
Substrate
Meas. Tech.
ChEBML_48951
Ki
0.023000±n/a nM
Citation
 Fevig, JMPinto, DJHan, QQuan, MLPruitt, JRJacobson, ICGalemmo, RAWang, SOrwat, MJBostrom, LLKnabb, RMWong, PCLam PYS, naWexler, RR Synthesis and SAR of benzamidine factor Xa inhibitors containing a vicinally-substituted heterocyclic core. Bioorg Med Chem Lett 11:641-5 (2001)  
Target
Name:
Coagulation factor X
Synonyms:
Activated coagulation factor X (FXa) Coagulation factor X precursor F10 Factor X heavy chain Factor Xa Stuart-Prower factor
Type:
Enzyme
Mol. Mass.:
54726.60
Organism:
Homo sapiens (Human)
Description:
Residue:
488
  
Inhibitor
Name:
BDBM50097624
Synonyms:
3-(3-Carbamimidoyl-phenyl)-3H-[1,2,3]triazole-4-carboxylic acid (2'-sulfamoyl-biphenyl-4-yl)-amide; TFA | CHEMBL157417
Type:
Small organic molecule
Emp. Form.:
C22H19N7O3S
Mol. Mass.:
461.496
SMILES:
NC(=N)c1cccc(c1)-n1nncc1C(=O)Nc1ccc(cc1)-c1ccccc1S(N)(=O)=O
: