Target
Trypsin
Ligand
BDBM50541448
Substrate
Meas. Tech.
ChEMBL_1984299 (CHEMBL4617705)
IC50
>1000000±n/a nM
Citation
 Hecker, SJReddy, KRLomovskaya, OGriffith, DCRubio-Aparicio, DNelson, KTsivkovski, RSun, DSabet, MTarazi, ZParkinson, JTotrov, MBoyer, SHGlinka, TWPemberton, OAChen, YDudley, MN Discovery of Cyclic Boronic Acid QPX7728, an Ultrabroad-Spectrum Inhibitor of Serine and Metallo-?-lactamases. J Med Chem 63:7491-7507 (2020)  
Target
Name:
Trypsin
Synonyms:
Serine protease 1/Trypsin-2/Trypsin-3
Type:
Mol. Mass.:
Description:
ASSAY_ID of ChEMBL is 2155713
Components:
This complex has 3 components.
Component 1
Name:
Serine protease 1
Synonyms:
Alpha-trypsin chain 1 Beta-trypsin PRSS1 TRP1 TRY1_HUMAN Thrombin & trypsin Trypsin I | Trypsin-1
Type:
Enzyme
Mol. Mass.:
26557.80
Organism:
Homo sapiens (Human)
Description:
P07477
Residue:
247
  
Component 2
Name:
Trypsin-2
Synonyms:
Anionic trypsinogen Serine protease 2 TRY2_HUMAN Thrombin & trypsin Trypsin II | Trypsin-2
Type:
PROTEIN
Mol. Mass.:
26479.43
Organism:
Homo sapiens (Human)
Description:
ChEMBL_41517
Residue:
247
  
Component 3
Name:
Trypsin-3
Synonyms:
Brain trypsinogen PRSS3 Serine protease 3 TRY3 TRY4 Trypsin Trypsin IV | Trypsin-3
Type:
PROTEIN
Mol. Mass.:
32532.52
Organism:
Homo sapiens (Human)
Description:
ChEMBL_216043
Residue:
304
  
Inhibitor
Name:
BDBM50541448
Synonyms:
CHEMBL4633785
Type:
Small organic molecule
Emp. Form.:
C10H8BFO4
Mol. Mass.:
221.978
SMILES:
[H][C@@]12C[C@]1([H])c1ccc(F)c(C(O)=O)c1OB2O
: