Target
Plasminogen
Ligand
BDBM50541448
Substrate
Meas. Tech.
ChEMBL_1984300 (CHEMBL4617706)
IC50
>1000000±n/a nM
Citation
 Hecker, SJReddy, KRLomovskaya, OGriffith, DCRubio-Aparicio, DNelson, KTsivkovski, RSun, DSabet, MTarazi, ZParkinson, JTotrov, MBoyer, SHGlinka, TWPemberton, OAChen, YDudley, MN Discovery of Cyclic Boronic Acid QPX7728, an Ultrabroad-Spectrum Inhibitor of Serine and Metallo-?-lactamases. J Med Chem 63:7491-7507 (2020)  
Target
Name:
Plasminogen
Synonyms:
Activation peptide PLG Plasmin Plasmin heavy chain A, short form | Plasmin light chain B
Type:
Enzyme
Mol. Mass.:
90579.18
Organism:
Homo sapiens (Human)
Description:
Residue:
810
  
Inhibitor
Name:
BDBM50541448
Synonyms:
CHEMBL4633785
Type:
Small organic molecule
Emp. Form.:
C10H8BFO4
Mol. Mass.:
221.978
SMILES:
[H][C@@]12C[C@]1([H])c1ccc(F)c(C(O)=O)c1OB2O
: