Target
Angiotensin-converting enzyme 2
Ligand
BDBM50541448
Substrate
Meas. Tech.
ChEMBL_1984310 (CHEMBL4617716)
IC50
>1000000±n/a nM
Citation
 Hecker, SJReddy, KRLomovskaya, OGriffith, DCRubio-Aparicio, DNelson, KTsivkovski, RSun, DSabet, MTarazi, ZParkinson, JTotrov, MBoyer, SHGlinka, TWPemberton, OAChen, YDudley, MN Discovery of Cyclic Boronic Acid QPX7728, an Ultrabroad-Spectrum Inhibitor of Serine and Metallo-?-lactamases. J Med Chem 63:7491-7507 (2020)  
Target
Name:
Angiotensin-converting enzyme 2
Synonyms:
ACE-related carboxypeptidase ACE2_HUMAN Angiotensin-converting enzyme homolog Metalloprotease MPROT15
Type:
Enzyme
Mol. Mass.:
92448.86
Organism:
Homo sapiens (Human)
Description:
Residue:
805
  
Inhibitor
Name:
BDBM50541448
Synonyms:
CHEMBL4633785
Type:
Small organic molecule
Emp. Form.:
C10H8BFO4
Mol. Mass.:
221.978
SMILES:
[H][C@@]12C[C@]1([H])c1ccc(F)c(C(O)=O)c1OB2O
: