Target
Urokinase-type plasminogen activator
Ligand
BDBM50098129
Substrate
Meas. Tech.
ChEBML_213156
Ki
1020±n/a nM
Citation
 Wilson, KJIllig, CRSubasinghe, NHoffman, JBRudolph, MJSoll, RMolloy, CJBone, RGreen, DRandall, TZhang, MLewandowski, FAZhou, ZSharp, CMaguire, DGrasberger, BDesJarlais, RLSpurlino, J Synthesis of thiophene-2-carboxamidines containing 2-aminothiazoles and their biological evaluation as urokinase inhibitors. Bioorg Med Chem Lett 11:915-8 (2001)  
Target
Name:
Urokinase-type plasminogen activator
Synonyms:
PLAU UROK_HUMAN Urokinase-type plasminogen activator (uPA) | Urokinase-type plasminogen activator/surface receptor
Type:
Enzyme
Mol. Mass.:
48528.62
Organism:
Homo sapiens (Human)
Description:
P00749
Residue:
431
  
Inhibitor
Name:
BDBM50098129
Synonyms:
2-{3-[4-(5-Carbamimidoyl-2-methylsulfanyl-thiophen-3-yl)-thiazol-2-ylamino]-phenoxy}-acetamide | CHEMBL170363
Type:
Small organic molecule
Emp. Form.:
C17H17N5O2S3
Mol. Mass.:
419.544
SMILES:
CSc1sc(cc1-c1csc(Nc2cccc(OCC(N)=O)c2)n1)C(N)=N
: