Target
Urokinase-type plasminogen activator
Ligand
BDBM50098132
Substrate
Meas. Tech.
ChEBML_213156
Ki
170±n/a nM
Citation
 Wilson, KJIllig, CRSubasinghe, NHoffman, JBRudolph, MJSoll, RMolloy, CJBone, RGreen, DRandall, TZhang, MLewandowski, FAZhou, ZSharp, CMaguire, DGrasberger, BDesJarlais, RLSpurlino, J Synthesis of thiophene-2-carboxamidines containing 2-aminothiazoles and their biological evaluation as urokinase inhibitors. Bioorg Med Chem Lett 11:915-8 (2001)  
Target
Name:
Urokinase-type plasminogen activator
Synonyms:
PLAU UROK_HUMAN Urokinase-type plasminogen activator (uPA) | Urokinase-type plasminogen activator/surface receptor
Type:
Enzyme
Mol. Mass.:
48528.62
Organism:
Homo sapiens (Human)
Description:
P00749
Residue:
431
  
Inhibitor
Name:
BDBM50098132
Synonyms:
5-Methyl-4-(2-phenylamino-thiazol-4-yl)-thiophene-2-carboxamidine | CHEMBL172637
Type:
Small organic molecule
Emp. Form.:
C15H14N4S2
Mol. Mass.:
314.428
SMILES:
Cc1sc(cc1-c1csc(Nc2ccccc2)n1)C(N)=N
: