Target
Urokinase-type plasminogen activator
Ligand
BDBM50098144
Substrate
Meas. Tech.
ChEBML_213156
Ki
80±n/a nM
Citation
 Wilson, KJIllig, CRSubasinghe, NHoffman, JBRudolph, MJSoll, RMolloy, CJBone, RGreen, DRandall, TZhang, MLewandowski, FAZhou, ZSharp, CMaguire, DGrasberger, BDesJarlais, RLSpurlino, J Synthesis of thiophene-2-carboxamidines containing 2-aminothiazoles and their biological evaluation as urokinase inhibitors. Bioorg Med Chem Lett 11:915-8 (2001)  
Target
Name:
Urokinase-type plasminogen activator
Synonyms:
PLAU UROK_HUMAN Urokinase-type plasminogen activator (uPA) | Urokinase-type plasminogen activator/surface receptor
Type:
Enzyme
Mol. Mass.:
48528.62
Organism:
Homo sapiens (Human)
Description:
P00749
Residue:
431
  
Inhibitor
Name:
BDBM50098144
Synonyms:
5-Methyl-4-[2-(4-phenoxy-phenylamino)-thiazol-4-yl]-thiophene-2-carboxamidine | CHEMBL352562
Type:
Small organic molecule
Emp. Form.:
C21H18N4OS2
Mol. Mass.:
406.524
SMILES:
Cc1sc(cc1-c1csc(Nc2ccc(Oc3ccccc3)cc2)n1)C(N)=N
: