Target
Protein cereblon
Ligand
BDBM65454
Substrate
Meas. Tech.
ChEMBL_1985380 (CHEMBL4618786)
Ki
1490±n/a nM
Citation
 Kargbo, RB Ligand Design for Cereblon Based Immunomodulatory Therapy. ACS Med Chem Lett 11:1088-1089 (2020)  
Target
Name:
Protein cereblon
Synonyms:
CRBN Protein cereblon
Type:
PROTEIN
Mol. Mass.:
50537.73
Organism:
Homo sapiens (Human)
Description:
ChEMBL_116917
Residue:
442
  
Inhibitor
Name:
BDBM65454
Synonyms:
191732-72-6 Lenalidomide Revlimid US9694015, 6.1
Type:
Small organic molecule
Emp. Form.:
C13H13N3O3
Mol. Mass.:
259.2606
SMILES:
Nc1cccc2C(=O)N(Cc12)C1CCC(=O)NC1=O
: