Target
Thrombospondin-1
Ligand
BDBM50541826
Substrate
Meas. Tech.
ChEMBL_1985421 (CHEMBL4618827)
IC50
5.2±n/a nM
Citation
 Suto, MJGupta, VMathew, BZhang, WPallero, MAMurphy-Ullrich, JE Identification of Inhibitors of Thrombospondin 1 Activation of TGF-?. ACS Med Chem Lett 11:1130-1136 (2020)  
Target
Name:
Thrombospondin-1
Synonyms:
Glycoprotein G TSP TSP1_HUMAN | Thrombospondin-1
Type:
PROTEIN
Mol. Mass.:
129327.50
Organism:
Homo sapiens
Description:
ChEMBL_119903
Residue:
1170
  
Inhibitor
Name:
BDBM50541826
Synonyms:
CHEMBL4644244
Type:
Small organic molecule
Emp. Form.:
C17H33N5O5
Mol. Mass.:
387.4744
SMILES:
CC(C)C[C@H](NC(=O)[C@H](CCCCN)NC(=O)[C@H](CO)NC(C)=O)C(N)=O
: