Target
N-alpha-acetyltransferase 50
Ligand
BDBM50541860
Substrate
Meas. Tech.
ChEMBL_1985503 (CHEMBL4618909)
IC50
14±n/a nM
Target
Name:
N-alpha-acetyltransferase 50
Synonyms:
2.3.1.- MAK3 N-acetyltransferase 5 N-alpha-acetyltransferase 50 NAA50 NAT13 NatE catalytic subunit hNAT5 hSAN
Type:
PROTEIN
Mol. Mass.:
19405.69
Organism:
Homo sapiens
Description:
ChEMBL_119947
Residue:
169
  
Inhibitor
Name:
BDBM50541860
Synonyms:
CHEMBL4639216
Type:
Small organic molecule
Emp. Form.:
C23H24N10O6
Mol. Mass.:
536.5001
SMILES:
CNC(=O)c1coc(n1)[C@@H]1C[C@@H](CN1C(=O)c1ccc(cc1)-c1nn[nH]n1)NC(=O)[C@@H]1CC(=O)N(C)C(=O)N1
: