Target
Intercellular adhesion molecule 1
Ligand
BDBM50098517
Substrate
Meas. Tech.
ChEMBL_89064 (CHEMBL697203)
IC50
8±n/a nM
Citation
 Stewart, AOBhatia, PAMcCarty, CMPatel, MVStaeger, MAArendsen, DLGunawardana, IWMelcher, LMZhu, GDBoyd, SAFry, DGCool, BLKifle, LLartey, KMarsh, KCKempf-Grote, AJKilgannon, PWisdom, WMeyer, JGallatin, WMOkasinski, GF Discovery of inhibitors of cell adhesion molecule expression in human endothelial cells. 1. Selective inhibition of ICAM-1 and E-selectin expression. J Med Chem 44:988-1002 (2001)  
Target
Name:
Intercellular adhesion molecule 1
Synonyms:
CD_antigen=CD54 ICAM1 Intercellular adhesion molecule (ICAM-1), Integrin alpha-L/beta-2 Intercellular adhesion molecule-1 | Major group rhinovirus receptor
Type:
PROTEIN
Mol. Mass.:
57831.10
Organism:
Homo sapiens (Human)
Description:
ChEMBL_826675
Residue:
532
  
Inhibitor
Name:
BDBM50098517
Synonyms:
4-(3,4-Dimethyl-phenylsulfanyl)-thieno[2,3-c]pyridine-2-carboxylic acid amide | CHEMBL267125
Type:
Small organic molecule
Emp. Form.:
C16H14N2OS2
Mol. Mass.:
314.425
SMILES:
Cc1ccc(Sc2cncc3sc(cc23)C(N)=O)cc1C
: