Target
Cathepsin K
Ligand
BDBM50098585
Substrate
Meas. Tech.
ChEMBL_216705 (CHEMBL820317)
Ki
54±n/a nM
Target
Name:
Cathepsin K
Synonyms:
CATK_HUMAN CTSO Cathepsin O Cathepsin X
Type:
Enzyme
Mol. Mass.:
36975.68
Organism:
Homo sapiens (Human)
Description:
P43235
Residue:
329
  
Inhibitor
Name:
BDBM50098585
Synonyms:
5-(2-Morpholin-4-yl-ethoxy)-benzofuran-2-carboxylic acid (1-{3-hydroxy-1-[2-(3-pyridin-2-yl-phenyl)-acetyl]-azepan-4-ylcarbamoyl}-3-methyl-butyl)-amide | CHEMBL418213
Type:
Small organic molecule
Emp. Form.:
C40H49N5O7
Mol. Mass.:
711.8464
SMILES:
CC(C)C[C@H](NC(=O)c1cc2cc(OCCN3CCOCC3)ccc2o1)C(=O)NC1CCCN(CC1O)C(=O)Cc1cccc(c1)-c1ccccn1
: