Target
Carbamoyl-phosphate synthase [ammonia], mitochondrial
Ligand
BDBM50542010
Substrate
Meas. Tech.
ChEMBL_1985814 (CHEMBL4619220)
IC50
360±n/a nM
Citation
 Rolfe, AYao, SNguyen, TVOmoto, KColombo, FVirrankoski, MVaillancourt, FHYu, LCook, AReynolds, DIoannidis, SZhu, PLarsen, NABolduc, DM Discovery of 2,6-Dimethylpiperazines as Allosteric Inhibitors of CPS1. ACS Med Chem Lett 11:1305-1309 (2020)  
Target
Name:
Carbamoyl-phosphate synthase [ammonia], mitochondrial
Synonyms:
6.3.4.16 CPSM_HUMAN Carbamoyl-phosphate synthase [ammonia], mitochondrial | Carbamoyl-phosphate synthetase I
Type:
PROTEIN
Mol. Mass.:
164941.07
Organism:
Homo sapiens
Description:
ChEMBL_105702
Residue:
1500
  
Inhibitor
Name:
BDBM50542010
Synonyms:
CHEMBL4636473
Type:
Small organic molecule
Emp. Form.:
C22H24F2N2O4
Mol. Mass.:
418.4338
SMILES:
COc1ccc(C(=O)N2C[C@@H](C)N([C@H](C)C2)C(=O)c2ccc(OC)cc2F)c(F)c1
: