Target
5-hydroxytryptamine receptor 2A
Ligand
BDBM50099269
Substrate
Meas. Tech.
ChEMBL_2277 (CHEMBL617063)
Ki
0.12±n/a nM
Citation
 Rowley, MHallett, DJGoodacre, SMoyes, CCrawforth, JSparey, TJPatel, SMarwood, RPatel, SThomas, SHitzel, LO'Connor, DSzeto, NCastro, JLHutson, PHMacLeod, AM 3-(4-Fluoropiperidin-3-yl)-2-phenylindoles as high affinity, selective, and orally bioavailable h5-HT(2A) receptor antagonists. J Med Chem 44:1603-14 (2001)  
Target
Name:
5-hydroxytryptamine receptor 2A
Synonyms:
5-HT-2 5-HT2A 5-hydroxytryptamine receptor 2A (5HT-2A) 5HT2A_HUMAN HTR2A | Serotonin receptor 2A
Type:
undefined
Mol. Mass.:
52607.65
Organism:
Homo sapiens (Human)
Description:
P28223
Residue:
471
  
Inhibitor
Name:
BDBM50099269
Synonyms:
6-Fluoro-2-(4-fluoro-phenyl)-3-(4-fluoro-piperidin-3-yl)-1H-indole | CHEMBL40312
Type:
Small organic molecule
Emp. Form.:
C19H17F3N2
Mol. Mass.:
330.3469
SMILES:
F[C@@H]1CCNCC1c1c([nH]c2cc(F)ccc12)-c1ccc(F)cc1
: