Target
D(2) dopamine receptor
Ligand
BDBM50099385
Substrate
Meas. Tech.
ChEBML_61121
Ki
460±n/a nM
Citation
 Nishimura, TIgarashi, JSunagawa, M Conformational analysis of tandospirone in aqueous solution: lead evolution of potent dopamine D4 receptor ligands. Bioorg Med Chem Lett 11:1141-4 (2001)  
Target
Name:
D(2) dopamine receptor
Synonyms:
D(2) dopamine receptor DOPAMINE D2 Long DRD2 Dopamine D2 receptor Dopamine D2 receptor (D2R) Dopamine2-like | d2
Type:
Cell-surface receptors
Mol. Mass.:
50647.10
Organism:
Homo sapiens (Human)
Description:
P14416
Residue:
443
  
Inhibitor
Name:
BDBM50099385
Synonyms:
(1S,2R,6S,7R)-4-[4-(4-Pyrimidin-2-yl-piperazin-1-yl)-butyl]-4-aza-tricyclo[5.2.1.0*2,6*]decane-3,5-dione | CHEMBL274047
Type:
Small organic molecule
Emp. Form.:
C21H29N5O2
Mol. Mass.:
383.4873
SMILES:
O=C1[C@H]2[C@@H]3CC[C@@H](C3)[C@H]2C(=O)N1CCCCN1CCN(CC1)c1ncccn1
: