Target
Dihydrofolate reductase
Ligand
BDBM50134036
Substrate
Meas. Tech.
ChEMBL_1988113 (CHEMBL4621660)
Ki
72000±n/a nM
Citation
 Duff, MRGabel, SAPedersen, LCDeRose, EFKrahn, JMHowell, EELondon, RE The Structural Basis for Nonsteroidal Anti-Inflammatory Drug Inhibition of Human Dihydrofolate Reductase. J Med Chem 63:8314-8324 (2020)  
Target
Name:
Dihydrofolate reductase
Synonyms:
DHFR Dihydrofolate reductase (DHFR) | Tetrahydrofolate dehydrogenase
Type:
Enzyme
Mol. Mass.:
21453.99
Organism:
Homo sapiens (Human)
Description:
Recombinant human DHFR.
Residue:
187
  
Inhibitor
Name:
BDBM50134036
Synonyms:
2-(2,3-Dimethyl-phenylamino)-benzoic acid 2-(2,3-dimethylphenylamino)benzoic acid CI-473 INF-3355 Ponstel mefanamic acid
Type:
Small organic molecule
Emp. Form.:
C15H15NO2
Mol. Mass.:
241.2851
SMILES:
Cc1cccc(Nc2ccccc2C(O)=O)c1C
: