Target
Substance-K receptor
Ligand
BDBM50099641
Substrate
Meas. Tech.
ChEMBL_209033 (CHEMBL818108)
Ki
51.6±n/a nM
Citation
 Blaney, FERaveglia, LFArtico, MCavagnera, SDartois, CFarina, CGrugni, MGagliardi, SLuttmann, MAMartinelli, MNadler, GMParini, CPetrillo, PSarau, HMScheideler, MAHay, DWGiardina, GA Stepwise modulation of neurokinin-3 and neurokinin-2 receptor affinity and selectivity in quinoline tachykinin receptor antagonists. J Med Chem 44:1675-89 (2001)  
Target
Name:
Substance-K receptor
Synonyms:
NK-2 receptor NK2R NKNAR Neurokinin A receptor Neurokinin-2 (NK-2) SKR TACR2 Tachykinin receptor 2 (NK2) | hnk-3
Type:
Protein
Mol. Mass.:
44455.78
Organism:
Homo sapiens (Human)
Description:
P21452
Residue:
398
  
Inhibitor
Name:
BDBM50099641
Synonyms:
3-Dimethylaminomethyl-2-phenyl-quinoline-4-carboxylic acid (2-methyl-1-phenyl-propyl)-amide | CHEMBL295059
Type:
Small organic molecule
Emp. Form.:
C29H31N3O
Mol. Mass.:
437.5759
SMILES:
CC(C)[C@H](NC(=O)c1c(CN(C)C)c(nc2ccccc12)-c1ccccc1)c1ccccc1
: