Target
Neuromedin-K receptor
Ligand
BDBM50099642
Substrate
Meas. Tech.
ChEMBL_220885 (CHEMBL824640)
Ki
454±n/a nM
Citation
 Blaney, FERaveglia, LFArtico, MCavagnera, SDartois, CFarina, CGrugni, MGagliardi, SLuttmann, MAMartinelli, MNadler, GMParini, CPetrillo, PSarau, HMScheideler, MAHay, DWGiardina, GA Stepwise modulation of neurokinin-3 and neurokinin-2 receptor affinity and selectivity in quinoline tachykinin receptor antagonists. J Med Chem 44:1675-89 (2001)  
Target
Name:
Neuromedin-K receptor
Synonyms:
NK-3 receptor NK3R NKR Neurokinin B receptor Neuromedin-3 receptor (NK-3R) Neuromedin-K receptor Neuromedin-K receptor (NK3) TAC3R Tachykinin receptor 3 | Tachykinin receptor 3 (NK3)
Type:
Enzyme
Mol. Mass.:
52221.96
Organism:
Homo sapiens (Human)
Description:
P29371
Residue:
465
  
Inhibitor
Name:
BDBM50099642
Synonyms:
3-(4-Isopropyl-piperazin-1-ylmethyl)-2-phenyl-quinoline-4-carboxylic acid (1,2-dimethyl-propyl)-amide | CHEMBL296122
Type:
Small organic molecule
Emp. Form.:
C29H38N4O
Mol. Mass.:
458.6382
SMILES:
CC(C)C(C)NC(=O)c1c(CN2CCN(CC2)C(C)C)c(nc2ccccc12)-c1ccccc1
: