Target
Receptor-type tyrosine-protein phosphatase C
Ligand
BDBM50099752
Substrate
Meas. Tech.
ChEMBL_39938 (CHEMBL655779)
IC50
600±n/a nM
Citation
 Urbanek, RASuchard, SJSteelman, GBKnappenberger, KSSygowski, LAVeale, CAChapdelaine, MJ Potent reversible inhibitors of the protein tyrosine phosphatase CD45. J Med Chem 44:1777-93 (2001)  
Target
Name:
Receptor-type tyrosine-protein phosphatase C
Synonyms:
CD45 L-CA PTPRC Receptor-type tyrosine-protein phosphatase C (CD45) | T200
Type:
Protein
Mol. Mass.:
147474.19
Organism:
Homo sapiens (Human)
Description:
P08575
Residue:
1306
  
Inhibitor
Name:
BDBM50099752
Synonyms:
CHEMBL54131 | [(9,10-Dioxo-9,10-dihydro-phenanthrene-3-carbonyl)-amino]-acetic acid tert-butyl ester
Type:
Small organic molecule
Emp. Form.:
C21H19NO5
Mol. Mass.:
365.3793
SMILES:
CC(C)(C)OC(=O)CNC(=O)c1ccc2C(=O)C(=O)c3ccccc3-c2c1
: