Target
D(3) dopamine receptor
Ligand
BDBM50099806
Substrate
Meas. Tech.
ChEMBL_62749 (CHEMBL674590)
Ki
0.8±n/a nM
Citation
 Huang, YLuedtke, RRFreeman, RAWu, LMach, RH Synthesis and structure-activity relationships of naphthamides as dopamine D3 receptor ligands. J Med Chem 44:1815-26 (2001)  
Target
Name:
D(3) dopamine receptor
Synonyms:
DOPAMINE D3 Dopamine D3 receptor | Drd3
Type:
Protein
Mol. Mass.:
49540.58
Organism:
Rattus norvegicus (Rat)
Description:
P19020
Residue:
446
  
Inhibitor
Name:
BDBM50099806
Synonyms:
4-Bromo-1-methoxy-naphthalene-2-carboxylic acid (1-cyclohexyl-pyrrolidin-3-yl)-amide | CHEMBL54865
Type:
Small organic molecule
Emp. Form.:
C22H27BrN2O2
Mol. Mass.:
431.366
SMILES:
COc1c(cc(Br)c2ccccc12)C(=O)N[C@H]1CCN(C1)C1CCCCC1
: