Target
D(2) dopamine receptor
Ligand
BDBM50099808
Substrate
Meas. Tech.
ChEMBL_62231 (CHEMBL675742)
Ki
94±n/a nM
Citation
 Huang, YLuedtke, RRFreeman, RAWu, LMach, RH Synthesis and structure-activity relationships of naphthamides as dopamine D3 receptor ligands. J Med Chem 44:1815-26 (2001)  
Target
Name:
D(2) dopamine receptor
Synonyms:
DOPAMINE D2 DOPAMINE D2 Short Dopamine D2 receptor Drd2
Type:
G Protein-Coupled Receptor (GPCR)
Mol. Mass.:
50931.60
Organism:
Rattus norvegicus (rat)
Description:
P61169
Residue:
444
  
Inhibitor
Name:
BDBM50099808
Synonyms:
4-Bromo-1-methoxy-naphthalene-2-carboxylic acid (1-cyclohexyl-piperidin-4-yl)-amide | CHEMBL51856
Type:
Small organic molecule
Emp. Form.:
C23H29BrN2O2
Mol. Mass.:
445.393
SMILES:
COc1c(cc(Br)c2ccccc12)C(=O)NC1CCN(CC1)C1CCCCC1
: