Target
Sigma non-opioid intracellular receptor 1
Ligand
BDBM50099801
Substrate
Meas. Tech.
ChEMBL_202070 (CHEMBL811340)
Ki
96±n/a nM
Citation
 Huang, YLuedtke, RRFreeman, RAWu, LMach, RH Synthesis and structure-activity relationships of naphthamides as dopamine D3 receptor ligands. J Med Chem 44:1815-26 (2001)  
Target
Name:
Sigma non-opioid intracellular receptor 1
Synonyms:
Aging-associated gene 8 protein SGMR1_HUMAN SIGMAR1 SR31747-binding protein Sigma 1-type opioid receptor Sigma1R | hSigmaR1
Type:
Enzyme Catalytic Domain
Mol. Mass.:
25124.85
Organism:
Homo sapiens (Human)
Description:
Q99720
Residue:
223
  
Inhibitor
Name:
BDBM50099801
Synonyms:
4-Bromo-1-methoxy-naphthalene-2-carboxylic acid (9-cycloheptyl-9-aza-bicyclo[3.3.1]non-3-yl)-amide | CHEMBL298864
Type:
Small organic molecule
Emp. Form.:
C27H35BrN2O2
Mol. Mass.:
499.483
SMILES:
COc1c(cc(Br)c2ccccc12)C(=O)NC1CC2CCCC(C1)N2C1CCCCCC1
: