Target
Toll-like receptor 7
Ligand
BDBM50543142
Substrate
Meas. Tech.
ChEMBL_1988677 (CHEMBL4622224)
IC50
0.620000±n/a nM
Citation
 Knoepfel, TNimsgern, PJacquier, SBourrel, MVangrevelinghe, EGlatthar, RBehnke, DAlper, PBMichellys, PYDeane, JJunt, TZipfel, GLimonta, SHawtin, SAndre, CBoulay, TLoetscher, PFaller, MBlank, JFeifel, RBetschart, C Target-Based Identification and Optimization of 5-Indazol-5-yl Pyridones as Toll-like Receptor 7 and 8 Antagonists Using a Biochemical TLR8 Antagonist Competition Assay. J Med Chem 63:8276-8295 (2020)  
Target
Name:
Toll-like receptor 7
Synonyms:
ORF Names:UNQ248/PRO285 TLR7_HUMAN | Toll-like receptor 7 (TLR7)
Type:
Enzyme
Mol. Mass.:
120945.35
Organism:
Homo sapiens (Human)
Description:
Q9NYK1
Residue:
1049
  
Inhibitor
Name:
BDBM50543142
Synonyms:
CHEMBL4641633
Type:
Small organic molecule
Emp. Form.:
C21H20F4N4O
Mol. Mass.:
420.4033
SMILES:
F[C@H]1CNCC[C@@H]1n1cc2cc(cc(c2n1)C(F)(F)F)-c1ccc(=O)n2CCCc12
: