Target
Urokinase-type plasminogen activator
Ligand
BDBM50099926
Substrate
Meas. Tech.
ChEBML_213135
Ki
530±n/a nM
Citation
 Subasinghe, NLIllig, CHoffman, JRudolph, MJWilson, KJSoll, RRandle, TGreen, DLewandowski, FZhang, MBone, RSpurlino, JDesJarlais, RDeckman, IMolloy, CJManthey, CZhou, ZSharp, CMaguire, DCrysler, CGrasberger, B Structure-based design, synthesis and SAR of a novel series of thiopheneamidine urokinase plasminogen activator inhibitors. Bioorg Med Chem Lett 11:1379-82 (2001)  
Target
Name:
Urokinase-type plasminogen activator
Synonyms:
PLAU UROK_HUMAN Urokinase-type plasminogen activator (uPA) | Urokinase-type plasminogen activator/surface receptor
Type:
Enzyme
Mol. Mass.:
48528.62
Organism:
Homo sapiens (Human)
Description:
P00749
Residue:
431
  
Inhibitor
Name:
BDBM50099926
Synonyms:
4-((E)-2-Benzo[1,3]dioxol-5-yl-vinyl)-benzo[b]thiophene-2-carboxamidine | CHEMBL282625
Type:
Small organic molecule
Emp. Form.:
C18H14N2O2S
Mol. Mass.:
322.381
SMILES:
NC(=N)c1cc2c(\C=C\c3ccc4OCOc4c3)cccc2s1
: