Target
Sigma non-opioid intracellular receptor 1
Ligand
BDBM50543317
Substrate
Meas. Tech.
ChEMBL_1988878 (CHEMBL4622425)
Kd
>1000±n/a nM
Citation
 Greenfield, DASchmidt, HRSkiba, MAMandler, MDAnderson, JRSliz, PKruse, AC Virtual Screening for Ligand Discovery at the ? ACS Med Chem Lett 11:1555-1561 (2020)  
Target
Name:
Sigma non-opioid intracellular receptor 1
Synonyms:
Aging-associated gene 8 protein SGMR1_HUMAN SIGMAR1 SR31747-binding protein Sigma 1-type opioid receptor Sigma1R | hSigmaR1
Type:
Enzyme Catalytic Domain
Mol. Mass.:
25124.85
Organism:
Homo sapiens (Human)
Description:
Q99720
Residue:
223
  
Inhibitor
Name:
BDBM50543317
Synonyms:
CHEMBL4638486
Type:
Small organic molecule
Emp. Form.:
C17H15BrF3N3
Mol. Mass.:
398.22
SMILES:
FC(F)(F)c1cccc(c1)N1CCC(N1)\N=C\c1ccc(Br)cc1
: