Target
Amyloid-beta precursor protein
Ligand
BDBM50100131
Substrate
Meas. Tech.
ChEMBL_35678 (CHEMBL649527)
Ki
0.4±n/a nM
Citation
 Zhuang, ZPKung, MPHou, CSkovronsky, DMGur, TLPlössl, KTrojanowski, JQLee, VMKung, HF Radioiodinated styrylbenzenes and thioflavins as probes for amyloid aggregates. J Med Chem 44:1905-14 (2001)  
Target
Name:
Amyloid-beta precursor protein
Synonyms:
A4 ABPP AICD-50 AICD-59 AID(57) APP Alzheimer disease amyloid protein Amyloid beta Protein Amyloid beta protein Abeta(1-42) Amyloid intracellular domain 57 Amyloid protein (Abeta42b) Beta amyloid A4 protein Beta-APP42 Beta-amyloid protein 42 C83 CVAP Gamma Secretase Gamma-CTF(57) Gamma-secretase Gamma-secretase C-terminal fragment 57 P3(40) PN-II Protease nexin-II S-APP-beta Soluble APP-beta | beta-Amyloid Precursor Protein (APP)
Type:
Single-pass type I membrane protein
Mol. Mass.:
86890.41
Organism:
Homo sapiens (Human)
Description:
P05067
Residue:
770
  
Inhibitor
Name:
BDBM50100131
Synonyms:
5-(Biphenyl-4-ylazo)-bis (2-hydroxy-benzoic acid)(Chrysamine G) CHEMBL300172 chrysamine G
Type:
Small organic molecule
Emp. Form.:
C26H18N4O6
Mol. Mass.:
482.4443
SMILES:
OC(=O)c1cc(ccc1O)N=Nc1ccc(cc1)-c1ccc(cc1)N=Nc1ccc(O)c(c1)C(O)=O
: