Target
Alpha-1A adrenergic receptor
Ligand
BDBM50087497
Substrate
Meas. Tech.
ChEMBL_34023 (CHEMBL646012)
Ki
0.69±n/a nM
Citation
 Meyer, MDAltenbach, RJBai, HBasha, FZCarroll, WAKerwin, JFLebold, SALee, EPratt, JKSippy, KBTietje, KWendt, MDBrune, MEBuckner, SAHancock, AADrizin, I Structure-activity studies for a novel series of bicyclic substituted hexahydrobenz[e]isoindole alpha1A adrenoceptor antagonists as potential agents for the symptomatic treatment of benign prostatic hyperplasia. J Med Chem 44:1971-85 (2001)  
Target
Name:
Alpha-1A adrenergic receptor
Synonyms:
ADA1A_RAT Adra1c Alpha-1A adrenoceptor Alpha-1C adrenergic receptor | adrenergic Alpha1A
Type:
Protein
Mol. Mass.:
51620.15
Organism:
Rattus norvegicus (Rat)
Description:
P43140
Residue:
466
  
Inhibitor
Name:
BDBM50087497
Synonyms:
3-Chloro-7-[2-(6-methoxy-1,3,3a,4,5,9b-hexahydro-benzo[e]isoindol-2-yl)-ethyl]-5H-9-thia-1,4,5,7-tetraaza-fluorene-6,8-dione | CHEMBL290387
Type:
Small organic molecule
Emp. Form.:
C23H22ClN5O3S
Mol. Mass.:
483.97
SMILES:
COc1cccc2[C@@H]3CN(CCn4c(=O)[nH]c5c6nc(Cl)cnc6sc5c4=O)C[C@@H]3CCc12
: