Target
Lysosomal acid glucosylceramidase
Ligand
BDBM50100428
Substrate
Meas. Tech.
ChEBML_37419
Ki
2.1±n/a nM
Citation
 Hermetter, AScholze, HStütz, AEWithers, SGWrodnigg, TM Powerful probes for glycosidases: novel, fluorescently tagged glycosidase inhibitors. Bioorg Med Chem Lett 11:1339-42 (2001)  
Target
Name:
Lysosomal acid glucosylceramidase
Synonyms:
Acid beta-glucosidase Beta-glucocerebrosidase D-glucosyl-N-acylsphingosine glucohydrolase GBA1 GC GLUC Glucosylceramidase (GBA) Glucosylceramidase precursor (Beta-glucocerebrosidase) (Acid beta-glucosidase) (D-glucosyl-N-acylsphingosine glucohydrolase) (Alglucerase) (Imiglucerase) beta-glucocerebrosidase (GCase)
Type:
Enzyme
Mol. Mass.:
59724.64
Organism:
Homo sapiens (Human)
Description:
The beta-Glu activity was measured with commercially available beta-glucocerebrosidase (Ceredase) as the enzyme source.
Residue:
536
  
Inhibitor
Name:
BDBM50100428
Synonyms:
6-(5-Dimethylamino-naphthalene-1-sulfonylamino)-hexanoic acid ((3S,4S,5R)-3,4-dihydroxy-5-hydroxymethyl-pyrrolidin-2-ylmethyl)-amide | CHEMBL3349997
Type:
Small organic molecule
Emp. Form.:
C24H36N4O6S
Mol. Mass.:
508.631
SMILES:
CN(C)c1cccc2c(cccc12)S(=O)(=O)NCCCCCC(=O)NC[C@H]1N[C@H](CO)[C@H](O)[C@@H]1O
: