Target
Adenosine kinase
Ligand
BDBM50100581
Substrate
Meas. Tech.
ChEMBL_88738 (CHEMBL700683)
IC50
>10000±n/a nM
Citation
 Lee, CHJiang, MCowart, MGfesser, GPerner, RKim, KHGu, YGWilliams, MJarvis, MFKowaluk, EAStewart, AOBhagwat, SS Discovery of 4-amino-5-(3-bromophenyl)-7-(6-morpholino-pyridin-3-yl)pyrido[2,3-d]pyrimidine, an orally active, non-nucleoside adenosine kinase inhibitor.. J Med Chem 44:2133-8 (2001)  
Target
Name:
Adenosine kinase
Synonyms:
ADK | ADK_HUMAN
Type:
PROTEIN
Mol. Mass.:
40545.97
Organism:
Homo sapiens (Human)
Description:
ChEMBL_1467841
Residue:
362
  
Inhibitor
Name:
BDBM50100581
Synonyms:
7-(4-Methoxy-phenyl)-pteridin-4-ylamine | CHEMBL67267
Type:
Small organic molecule
Emp. Form.:
C13H11N5O
Mol. Mass.:
253.2593
SMILES:
COc1ccc(cc1)-c1cnc2c(N)ncnc2n1
: