Target
Adenosine kinase
Ligand
BDBM50100583
Substrate
Meas. Tech.
ChEMBL_31125 (CHEMBL643553)
IC50
91.7±n/a nM
Citation
 Lee, CHJiang, MCowart, MGfesser, GPerner, RKim, KHGu, YGWilliams, MJarvis, MFKowaluk, EAStewart, AOBhagwat, SS Discovery of 4-amino-5-(3-bromophenyl)-7-(6-morpholino-pyridin-3-yl)pyrido[2,3-d]pyrimidine, an orally active, non-nucleoside adenosine kinase inhibitor.. J Med Chem 44:2133-8 (2001)  
Target
Name:
Adenosine kinase
Synonyms:
ADENOSINE Adenosine 5-phosphotransferase Adenosine kinase | Adk
Type:
Enzyme
Mol. Mass.:
40130.14
Organism:
Rattus norvegicus (rat)
Description:
Rat brain cytosol as enzyme source.
Residue:
361
  
Inhibitor
Name:
BDBM50100583
Synonyms:
7-(4-Dimethylamino-phenyl)-6-(4-methoxy-phenyl)-pyrido[2,3-d]pyrimidin-4-ylamine | CHEMBL302938
Type:
Small organic molecule
Emp. Form.:
C22H21N5O
Mol. Mass.:
371.435
SMILES:
COc1ccc(cc1)-c1cc2c(N)ncnc2nc1-c1ccc(cc1)N(C)C
: