Target
Adenosine kinase
Ligand
BDBM50100586
Substrate
Meas. Tech.
ChEMBL_88738 (CHEMBL700683)
IC50
700±n/a nM
Citation
 Lee, CHJiang, MCowart, MGfesser, GPerner, RKim, KHGu, YGWilliams, MJarvis, MFKowaluk, EAStewart, AOBhagwat, SS Discovery of 4-amino-5-(3-bromophenyl)-7-(6-morpholino-pyridin-3-yl)pyrido[2,3-d]pyrimidine, an orally active, non-nucleoside adenosine kinase inhibitor.. J Med Chem 44:2133-8 (2001)  
Target
Name:
Adenosine kinase
Synonyms:
ADK | ADK_HUMAN
Type:
PROTEIN
Mol. Mass.:
40545.97
Organism:
Homo sapiens (Human)
Description:
ChEMBL_1467841
Residue:
362
  
Inhibitor
Name:
BDBM50100586
Synonyms:
3-[4-Amino-7-(4-dimethylamino-phenyl)-pyrido[2,3-d]pyrimidin-6-yl]-benzoic acid methyl ester | CHEMBL416498
Type:
Small organic molecule
Emp. Form.:
C23H21N5O2
Mol. Mass.:
399.4451
SMILES:
COC(=O)c1cccc(c1)-c1cc2c(N)ncnc2nc1-c1ccc(cc1)N(C)C
: