Target
Interstitial collagenase
Ligand
BDBM50100914
Substrate
Meas. Tech.
ChEBML_106111
IC50
>10000000±n/a nM
Citation
 Michaelides, MRDellaria, JFGong, JHolms, JHBouska, JJStacey, JWada, CKHeyman, HRCurtin, MLGuo, YGoodfellow, CLElmore, IBAlbert, DHMagoc, TJMarcotte, PAMorgan, DWDavidsen, SK Biaryl ether retrohydroxamates as potent, long-lived, orally bioavailable MMP inhibitors. Bioorg Med Chem Lett 11:1553-6 (2001)  
Target
Name:
Interstitial collagenase
Synonyms:
CLG MMP1 Matrix metalloproteinase-1 | Matrix metalloproteinase-1 (MMP-1)
Type:
Enzyme
Mol. Mass.:
54010.26
Organism:
Homo sapiens (Human)
Description:
P03956
Residue:
469
  
Inhibitor
Name:
BDBM50100914
Synonyms:
CHEMBL42862 | N-[1-(4'-Cyano-biphenyl-4-yloxymethyl)-3-methyl-butyl]-N-hydroxy-formamide
Type:
Small organic molecule
Emp. Form.:
C20H22N2O3
Mol. Mass.:
338.4003
SMILES:
CC(C)CC(COc1ccc(cc1)-c1ccc(cc1)C#N)N(O)C=O
: