Target
DNA (cytosine-5)-methyltransferase 3A
Ligand
BDBM22984
Substrate
Meas. Tech.
ChEMBL_1991438 (CHEMBL4625173)
IC50
3000±n/a nM
Citation
 Sergeev, AVorobyov, AYakubovskaya, MKirsanova, OGromova, E Novel anticancer drug curaxin CBL0137 impairs DNA methylation by eukaryotic DNA methyltransferase Dnmt3a. Bioorg Med Chem Lett 30:0 (2020)  
Target
Name:
DNA (cytosine-5)-methyltransferase 3A
Synonyms:
2.1.1.- Cysteine methyltransferase DNMT3A DNA MTase MmuIIIA DNM3A_MOUSE | Dnmt3a
Type:
PROTEIN
Mol. Mass.:
101671.89
Organism:
Mus musculus
Description:
ChEMBL_108012
Residue:
908
  
Inhibitor
Name:
BDBM22984
Synonyms:
(8S,10S)-10-{[(2R,4S,5S,6S)-4-amino-5-hydroxy-6-methyloxan-2-yl]oxy}-6,8,11-trihydroxy-8-(2-hydroxyacetyl)-1-methoxy-5,7,8,9,10,12-hexahydrotetracene-5,12-dione Adriblastina Doxil | Doxorubicin
Type:
Antibiotic
Emp. Form.:
C27H29NO11
Mol. Mass.:
543.5193
SMILES:
COc1cccc2C(=O)c3c(O)c4C[C@](O)(C[C@H](O[C@H]5C[C@H](N)[C@H](O)[C@H](C)O5)c4c(O)c3C(=O)c12)C(=O)CO
: