Target
Phospholipase A and acyltransferase 5
Ligand
BDBM50544592
Substrate
Meas. Tech.
ChEMBL_1993180 (CHEMBL4626915)
IC50
63±n/a nM
Citation
 Zhou, JMock, EDAl Ayed, KDi, XKantae, VBurggraaff, LStevens, AFMartella, AMohr, FJiang, Mvan der Wel, TWendel, TJOfman, TPTran, Yde Koster, Nvan Westen, GJPHankemeier, Tvan der Stelt, M Structure-Activity Relationship Studies of ?-Ketoamides as Inhibitors of the Phospholipase A and Acyltransferase Enzyme Family. J Med Chem 63:9340-9359 (2020)  
Target
Name:
Phospholipase A and acyltransferase 5
Synonyms:
2.3.1.- 3.1.1.4 H-rev107-like protein 5 HRASLS5 HRSL5 PLAT5_HUMAN iNAT
Type:
PROTEIN
Mol. Mass.:
30316.43
Organism:
Homo sapiens
Description:
ChEMBL_119943
Residue:
279
  
Inhibitor
Name:
BDBM50544592
Synonyms:
CHEMBL4644464
Type:
Small organic molecule
Emp. Form.:
C23H23N3O3
Mol. Mass.:
389.447
SMILES:
O=C(CCCc1ccccc1)C(=O)NCCc1ccc(Oc2cnccn2)cc1
: