Target
Coagulation factor X
Ligand
BDBM50101883
Substrate
Meas. Tech.
ChEBML_48813
Ki
2±n/a nM
Citation
 Rai, RKolesnikov, ALi, YYoung, WBLeahy, ESprengeler, PAVerner, EShrader, WDBurgess-Henry, JSangalang, JCAllen, DChen, XKatz, BALuong, CElrod, KCregar, L Development of potent and selective factor Xa inhibitors. Bioorg Med Chem Lett 11:1797-800 (2001)  
Target
Name:
Coagulation factor X
Synonyms:
Activated coagulation factor X (FXa) Coagulation factor X precursor F10 Factor X heavy chain Factor Xa Stuart-Prower factor
Type:
Enzyme
Mol. Mass.:
54726.60
Organism:
Homo sapiens (Human)
Description:
Residue:
488
  
Inhibitor
Name:
BDBM50101883
Synonyms:
2-[3-(3-Benzyl-5-carbamimidoyl-1H-indol-2-yl)-5-bromo-4-hydroxy-phenyl]-N,N-dimethyl-acetamide | CHEMBL50090
Type:
Small organic molecule
Emp. Form.:
C26H25BrN4O2
Mol. Mass.:
505.406
SMILES:
CN(C)C(=O)Cc1cc(Br)c(O)c(c1)-c1[nH]c2ccc(cc2c1Cc1ccccc1)C(N)=N
: