Target
Adenosine receptor A2b
Ligand
BDBM50094691
Substrate
Meas. Tech.
ChEMBL_30423 (CHEMBL645977)
Ki
261±n/a nM
Citation
 Baraldi, PGCacciari, BMoro, SRomagnoli, RJi Xd, naJacobson, KAGessi, SBorea, PASpalluto, G Fluorosulfonyl- and bis-(beta-chloroethyl)amino-phenylamino functionalized pyrazolo[4,3-e]1,2,4-triazolo[1,5-c]pyrimidine derivatives: irreversible antagonists at the human A3 adenosine receptor and molecular modeling studies. J Med Chem 44:2735-42 (2001)  
Target
Name:
Adenosine receptor A2b
Synonyms:
AA2BR_HUMAN ADORA2B Adenosine receptors A2b | Adenosine receptors; A2a & A2b
Type:
G Protein-Coupled Receptor (GPCR)
Mol. Mass.:
36341.22
Organism:
Homo sapiens (Human)
Description:
Residue:
332
  
Inhibitor
Name:
BDBM50094691
Synonyms:
1-(2-(furan-2-yl)-8-methyl-8H-pyrazolo[4,3-e][1,2,4]triazolo[1,5-c]pyrimidin-5-yl)-3-(4-methoxyphenyl)urea CHEMBL329791
Type:
Small organic molecule
Emp. Form.:
C19H16N8O3
Mol. Mass.:
404.3821
SMILES:
COc1ccc(NC(=O)Nc2nc3nn(C)cc3c3nc(nn23)-c2ccco2)cc1
: