Target
Plasminogen
Ligand
BDBM50102775
Substrate
Meas. Tech.
ChEMBL_155240 (CHEMBL764730)
Ki
35000±n/a nM
Citation
 Verner, EKatz, BASpencer, JRAllen, DHataye, JHruzewicz, WHui, HCKolesnikov, ALi, YLuong, CMartelli, ARadika, KRai, RShe, MShrader, WSprengeler, PATrapp, SWang, JYoung, WBMackman, RL Development of serine protease inhibitors displaying a multicentered short (<2.3 A) hydrogen bond binding mode: inhibitors of urokinase-type plasminogen activator and factor Xa. J Med Chem 44:2753-71 (2001)  
Target
Name:
Plasminogen
Synonyms:
Activation peptide PLG Plasmin Plasmin heavy chain A, short form | Plasmin light chain B
Type:
Enzyme
Mol. Mass.:
90579.18
Organism:
Homo sapiens (Human)
Description:
Residue:
810
  
Inhibitor
Name:
BDBM50102775
Synonyms:
2-(2-Hydroxy-4-methyl-phenyl)-1H-benzoimidazole-5-carboxamidine | CHEMBL92865
Type:
Small organic molecule
Emp. Form.:
C15H14N4O
Mol. Mass.:
266.2979
SMILES:
Cc1ccc(-c2nc3ccc(cc3[nH]2)C(N)=N)c(O)c1
: