Target
Tissue-type plasminogen activator
Ligand
BDBM50102787
Substrate
Meas. Tech.
ChEMBL_225382 (CHEMBL847816)
Ki
14000±n/a nM
Citation
 Verner, EKatz, BASpencer, JRAllen, DHataye, JHruzewicz, WHui, HCKolesnikov, ALi, YLuong, CMartelli, ARadika, KRai, RShe, MShrader, WSprengeler, PATrapp, SWang, JYoung, WBMackman, RL Development of serine protease inhibitors displaying a multicentered short (<2.3 A) hydrogen bond binding mode: inhibitors of urokinase-type plasminogen activator and factor Xa. J Med Chem 44:2753-71 (2001)  
Target
Name:
Tissue-type plasminogen activator
Synonyms:
Alteplase Reteplase Thrombin receptor protein Tissue-type plasminogen activator (tPA) t-PA t-plasminogen activator
Type:
Enzyme
Mol. Mass.:
62931.08
Organism:
Homo sapiens (Human)
Description:
Residue:
562
  
Inhibitor
Name:
BDBM50102787
Synonyms:
2-(2-Hydroxy-3-nitro-phenyl)-1H-benzoimidazole-5-carboxamidine | CHEMBL327789
Type:
Small organic molecule
Emp. Form.:
C14H11N5O3
Mol. Mass.:
297.2688
SMILES:
NC(=N)c1ccc2nc([nH]c2c1)-c1cccc(c1O)[N+]([O-])=O
: