Target
Urokinase-type plasminogen activator
Ligand
BDBM50102782
Substrate
Meas. Tech.
ChEMBL_226004 (CHEMBL842145)
Ki
3600±n/a nM
Citation
 Verner, EKatz, BASpencer, JRAllen, DHataye, JHruzewicz, WHui, HCKolesnikov, ALi, YLuong, CMartelli, ARadika, KRai, RShe, MShrader, WSprengeler, PATrapp, SWang, JYoung, WBMackman, RL Development of serine protease inhibitors displaying a multicentered short (<2.3 A) hydrogen bond binding mode: inhibitors of urokinase-type plasminogen activator and factor Xa. J Med Chem 44:2753-71 (2001)  
Target
Name:
Urokinase-type plasminogen activator
Synonyms:
PLAU UROK_HUMAN Urokinase-type plasminogen activator (uPA) | Urokinase-type plasminogen activator/surface receptor
Type:
Enzyme
Mol. Mass.:
48528.62
Organism:
Homo sapiens (Human)
Description:
P00749
Residue:
431
  
Inhibitor
Name:
BDBM50102782
Synonyms:
2-(2-Hydroxy-5-methoxy-phenyl)-1H-benzoimidazole-5-carboxamidine | CHEMBL96493
Type:
Small organic molecule
Emp. Form.:
C15H14N4O2
Mol. Mass.:
282.2973
SMILES:
COc1ccc(O)c(c1)-c1nc2ccc(cc2[nH]1)C(N)=N
: