Target
Plasminogen
Ligand
BDBM50100897
Substrate
Meas. Tech.
ChEMBL_155240 (CHEMBL764730)
Ki
46000±n/a nM
Citation
 Verner, EKatz, BASpencer, JRAllen, DHataye, JHruzewicz, WHui, HCKolesnikov, ALi, YLuong, CMartelli, ARadika, KRai, RShe, MShrader, WSprengeler, PATrapp, SWang, JYoung, WBMackman, RL Development of serine protease inhibitors displaying a multicentered short (<2.3 A) hydrogen bond binding mode: inhibitors of urokinase-type plasminogen activator and factor Xa. J Med Chem 44:2753-71 (2001)  
Target
Name:
Plasminogen
Synonyms:
Activation peptide PLG Plasmin Plasmin heavy chain A, short form | Plasmin light chain B
Type:
Enzyme
Mol. Mass.:
90579.18
Organism:
Homo sapiens (Human)
Description:
Residue:
810
  
Inhibitor
Name:
BDBM50100897
Synonyms:
2-(2-Hydroxy-phenyl)-1H-benzoimidazole-5-carboxamidine 2-{5-[AMINO(IMINIO)METHYL]-1H-BENZIMIDAZOL-2-YL}BENZENOLATE | CHEMBL433501
Type:
Small organic molecule
Emp. Form.:
C14H12N4O
Mol. Mass.:
252.2713
SMILES:
NC(=N)c1ccc2nc([nH]c2c1)-c1ccccc1O
: