Target
5-hydroxytryptamine receptor 3A
Ligand
BDBM50103075
Substrate
Meas. Tech.
ChEMBL_3480 (CHEMBL619058)
Ki
1.7±n/a nM
Citation
 Parihar, HSSuryanarayanan, AMa, CJoshi, PVenkataraman, PSchulte, MKKirschbaum, KS 5-HT(3)R binding of lerisetron: an interdisciplinary approach to drug-Receptor interactions. Bioorg Med Chem Lett 11:2133-6 (2001)  
Target
Name:
5-hydroxytryptamine receptor 3A
Synonyms:
5-HT-3 5-HT3A 5-hydroxytryptamine receptor 3 (5-HT3) 5-hydroxytryptamine receptor 3A (5HT3A) 5HT3R HTR3A Serotonin 3 receptor (5HT3) Serotonin-gated ion channel receptor | Serotonin-gated ion channel receptor 3
Type:
Protein
Mol. Mass.:
55283.27
Organism:
Homo sapiens (Human)
Description:
P46098
Residue:
478
  
Inhibitor
Name:
BDBM50103075
Synonyms:
1-(4-Methyl-benzyl)-2-piperazin-1-yl-1H-benzoimidazole | CHEMBL66918
Type:
Small organic molecule
Emp. Form.:
C19H22N4
Mol. Mass.:
306.4048
SMILES:
Cc1ccc(Cn2c(nc3ccccc23)N2CCNCC2)cc1
: