Target
Sodium channel protein type 9 subunit alpha
Ligand
BDBM50545569
Substrate
Meas. Tech.
ChEMBL_1995870 (CHEMBL4629765)
IC50
33±n/a nM
Citation
Target
Name:
Sodium channel protein type 9 subunit alpha
Synonyms:
Kiaa4197 Peripheral sodium channel 1 Scn9a Sodium channel protein type IX subunit alpha | Voltage-gated sodium channel subunit alpha Nav1.7
Type:
PROTEIN
Mol. Mass.:
225808.99
Organism:
Mus musculus
Description:
ChEMBL_109594
Residue:
1984
  
Inhibitor
Name:
BDBM50545569
Synonyms:
CHEMBL4637997
Type:
Small organic molecule
Emp. Form.:
C24H20F3N5O2S
Mol. Mass.:
499.508
SMILES:
Cn1nccc1-c1cc(ccc1[C@H]1CCc2cc(ccc12)S(=O)(=O)Nc1ncccn1)C(F)(F)F
: