Target
Urokinase-type plasminogen activator
Ligand
BDBM50103651
Substrate
Meas. Tech.
ChEBML_213155
Ki
0.460000±n/a nM
Citation
 Young, WBKolesnikov, ARai, RSprengeler, PALeahy, EMShrader, WDSangalang, JBurgess-Henry, JSpencer, JElrod, KCregar, L Optimization of a screening lead for factor VIIa/TF. Bioorg Med Chem Lett 11:2253-6 (2001)  
Target
Name:
Urokinase-type plasminogen activator
Synonyms:
PLAU UROK_HUMAN Urokinase-type plasminogen activator (uPA) | Urokinase-type plasminogen activator/surface receptor
Type:
Enzyme
Mol. Mass.:
48528.62
Organism:
Homo sapiens (Human)
Description:
P00749
Residue:
431
  
Inhibitor
Name:
BDBM50103651
Synonyms:
2-(3'-Amino-5-chloro-2-hydroxy-biphenyl-3-yl)-1H-benzoimidazole-5-carboxamidine | CHEMBL73737
Type:
Small organic molecule
Emp. Form.:
C20H16ClN5O
Mol. Mass.:
377.827
SMILES:
NC(=N)c1ccc2nc([nH]c2c1)-c1cc(Cl)cc(-c2cccc(N)c2)c1O
: