Target
Muscarinic acetylcholine receptor M2
Ligand
BDBM50103768
Substrate
Meas. Tech.
ChEMBL_139752 (CHEMBL745193)
Ki
0.510000±n/a nM
Citation
 Boyle, CDChackalamannil, SClader, JWGreenlee, WJJosien, HBKaminski, JJKozlowski, JAMcCombie, SWNazareno, DVTagat, JRWang, YZhou, GBillard, WBinch, HCrosby, GCohen-Williams, MCoffin, VLCox, KAGrotz, DEDuffy, RARuperto, VLachowicz, JE Metabolic stabilization of benzylidene ketal M(2) muscarinic receptor antagonists via halonaphthoic acid substitution. Bioorg Med Chem Lett 11:2311-4 (2001)  
Target
Name:
Muscarinic acetylcholine receptor M2
Synonyms:
ACM2_HUMAN Cholinergic, muscarinic M2 Muscarinic acetylcholine receptor M2 and M5 | RecName: Full=Muscarinic acetylcholine receptor M2
Type:
GPCR
Mol. Mass.:
51730.61
Organism:
Homo sapiens (Human)
Description:
P08172
Residue:
466
  
Inhibitor
Name:
BDBM50103768
Synonyms:
(5-Bromo-naphthalen-1-yl)-(4-{2-[4-(4-methoxy-benzenesulfonyl)-phenyl]-[1,3]dioxolan-2-yl}-[1,4']bipiperidinyl-1'-yl)-methanone | CHEMBL311099
Type:
Small organic molecule
Emp. Form.:
C37H39BrN2O6S
Mol. Mass.:
719.684
SMILES:
COc1ccc(cc1)S(=O)(=O)c1ccc(cc1)C1(OCCO1)C1CCN(CC1)C1CCN(CC1)C(=O)c1cccc2c(Br)cccc12
: